BDBM350028 US10208024, Example 27::US10766881, Example 27
SMILES COc1cc(OC)cc(c1)-n1nc(ccc1=O)-c1nc(cnc1N)-c1cnn(C[C@@H]2CNC(C)(C)CO2)c1
InChI Key InChIKey=MLGJITMGHIKNFO-FQEVSTJZSA-N
Data  6 IC50
  Tab Delimited (TSV)   2D SDfile   Computed 3D by Vconf -m prep SDfile
Find this compound or compounds like it in BindingDB:
Activity Spreadsheet -- Enzyme Inhibition Constant Data from BindingDB
Found 1 hit for monomerid = 350028
TargetFibroblast growth factor receptor 1 [308-731](Homo sapiens (Human))
Array Biopharma
US Patent
LigandPNGBDBM350028(US10208024, Example 27 | US10766881, Example 27)
Affinity DataIC50:  19nM. Assay description: To measure FGFR1 kinase activity, 200 pM His-tagged recombinant human FGFR1 catalytic domain (amino acids 308-731) (Life Technologies Cat. No. PR4660...
Ligand InfoPC cidPC sid
In DepthDetails US Patent